3,5-diCF3-anilide anion

Gas phase ion energetics data

Data compiled by: John E. Bartmess

Electron affinity of neutral species

EAneutral (eV) Method Reference Comment
2.63 ± 0.10D-EATaft and Topsom, 1987

Protonation reactions

C8H4F6N- + Hydrogen cation = Benzenamine, 3,5-bis(trifluoromethyl)-

By formula: C8H4F6N- + H+ = C8H5F6N

Quantity Value Units Method Reference Comment
Δr1456. ± 8.8kJ/molG+TSTaft and Topsom, 1987gas phase
Quantity Value Units Method Reference Comment
Δr1425. ± 8.4kJ/molIMRETaft and Topsom, 1987gas phase

Reaction thermochemistry data

Data compiled by: John E. Bartmess

Individual Reactions

C8H4F6N- + Hydrogen cation = Benzenamine, 3,5-bis(trifluoromethyl)-

By formula: C8H4F6N- + H+ = C8H5F6N

Quantity Value Units Method Reference Comment
Δr1456. ± 8.8kJ/molG+TSTaft and Topsom, 1987gas phase
Quantity Value Units Method Reference Comment
Δr1425. ± 8.4kJ/molIMRETaft and Topsom, 1987gas phase

References

Taft and Topsom, 1987
Taft, R.W.; Topsom, R.D., The Nature and Analysis of Substituent Effects, Prog. Phys. Org. Chem., 1987, 16, 1. [all data]