(H2O)6..adenine radical anion

Gas phase ion energetics data

Data compiled by: John E. Bartmess

Electron affinity of neutral species

EAneutral (eV) Method Reference Comment
1.08 ± 0.10LPESEustis, Wang, et al., 2007EA is threshhold energy. Vertical Detachment Energy: 1.60±0.05 eV

References

Eustis, Wang, et al., 2007
Eustis, S.; Wang, D.; Lyapustina, S.; Bowen, K.H., Photoelectron spectroscopy of hydrated adenine anions, J. Chem. Phys., 2007, 127, 22, 224309, https://doi.org/10.1063/1.2806033 . [all data]