(MeOH)3..Ph2CO radical anion

Gas phase ion energetics data

Data compiled by: John E. Bartmess

Electron affinity of neutral species

EAneutral (eV) Method Reference Comment
2.170 ± 0.040LPESMaeyama, Yagi, et al., 2008Stated electron affinity is the Vertical Detachment Energy
1.820 ± 0.040LPESYagi, Maeyama, et al., 2007Stated electron affinity is the Vertical Detachment Energy

References

Maeyama, Yagi, et al., 2008
Maeyama, T.; Yagi, I.; Fujii, A.; Mikami, N., Photoelectron spectroscopy of microsolvated benzophenone radical anions to reveal the origin of solvatochromic shifts in alcoholic media, Chem. Phys. Lett., 2008, 457, 1-3, 18-22, https://doi.org/10.1016/j.cplett.2008.03.055 . [all data]

Yagi, Maeyama, et al., 2007
Yagi, I.; Maeyama, T.; Fujii, A.; Mikami, N., Stepwise solvatochromism of ketyl anions in the gas phase: Photodetachment excitation spectroscopy of benzophenone and acetophenone radical anions microsolvated with methanol, J. Phys. Chem. A, 2007, 111, 31, 7646-7652, https://doi.org/10.1021/jp072167l . [all data]