mSO2CF3-anilide anion

Reaction thermochemistry data

Data compiled by: John E. Bartmess

Individual Reactions

C7H5F3NO2S- + Hydrogen cation = C7H6F3NO2S

By formula: C7H5F3NO2S- + H+ = C7H6F3NO2S

Quantity Value Units Method Reference Comment
Δr1451. ± 8.8kJ/molG+TSTaft and Topsom, 1987gas phase
Quantity Value Units Method Reference Comment
Δr1421. ± 8.4kJ/molIMRETaft and Topsom, 1987gas phase

Gas phase ion energetics data

Data compiled by: John E. Bartmess

Electron affinity of neutral species

EAneutral (eV) Method Reference Comment
2.61 ± 0.10D-EATaft and Topsom, 1987

Protonation reactions

C7H5F3NO2S- + Hydrogen cation = C7H6F3NO2S

By formula: C7H5F3NO2S- + H+ = C7H6F3NO2S

Quantity Value Units Method Reference Comment
Δr346.9 ± 2.1kcal/molG+TSTaft and Topsom, 1987gas phase
Quantity Value Units Method Reference Comment
Δr339.6 ± 2.0kcal/molIMRETaft and Topsom, 1987gas phase

References

Taft and Topsom, 1987
Taft, R.W.; Topsom, R.D., The Nature and Analysis of Substituent Effects, Prog. Phys. Org. Chem., 1987, 16, 1. [all data]