N-Me-5-imidazolide anion

Gas phase ion energetics data

Data compiled by: John E. Bartmess

Electron affinity of neutral species

EAneutral (eV) Method Reference Comment
1.9870 ± 0.0080LPESVillano, Gianola, et al., 2007

References

Villano, Gianola, et al., 2007
Villano, S.M.; Gianola, A.J.; Eyet, N.; Ichino, T.; Kato, S.; Bierbaum, V.M.; Lineberger, W.C., Thermochemical studies of N-methylpyrazole and N-methylimidazole, J. Phys. Chem. A, 2007, 111, 35, 8579-8587, https://doi.org/10.1021/jp073475m . [all data]