(Xe)2..Cl anion

Reaction thermochemistry data

Data compiled by: John E. Bartmess

Individual Reactions

ClXe- + 2Xenon = ClXe2-

By formula: ClXe- + 2Xe = ClXe2-

Quantity Value Units Method Reference Comment
Δr3.70 ± 0.40kcal/molTDAsWada, Kikkawa, et al., 2007gas phase
Quantity Value Units Method Reference Comment
Δr-2.26 ± 0.40kcal/molTDAsWada, Kikkawa, et al., 2007gas phase

References

Wada, Kikkawa, et al., 2007
Wada, A.; Kikkawa, A.; Sugiyama, T.; Hiraoka, K., Thermochemical Stabilities of the Gas-phase Cluster Ions of Halide Ions with Rare Gas Atoms, Int. J. Mass Spectrom.., 2007, 267, 1-3, 284-287, https://doi.org/10.1016/j.ijms.2007.02.053 . [all data]