(Xe)3..F anion

Gas phase thermochemistry data

Data compiled by: John E. Bartmess

Quantity Value Units Method Reference Comment
Δfgas-317.9 ± 2.5kJ/molTherWada, Kikkawa, et al., 2007

Reaction thermochemistry data

Data compiled by: John E. Bartmess

Individual Reactions

FXe2- + 3Xenon = FXe3-

By formula: FXe2- + 3Xe = FXe3-

Quantity Value Units Method Reference Comment
Δr20.9 ± 1.7kJ/molTDAsWada, Kikkawa, et al., 2007gas phase
Quantity Value Units Method Reference Comment
Δr-2.8 ± 1.7kJ/molTDAsWada, Kikkawa, et al., 2007gas phase

Ion clustering data

Data compiled by: John E. Bartmess

Clustering reactions

FXe2- + 3Xenon = FXe3-

By formula: FXe2- + 3Xe = FXe3-

Quantity Value Units Method Reference Comment
Δr20.9 ± 1.7kJ/molTDAsWada, Kikkawa, et al., 2007gas phase
Quantity Value Units Method Reference Comment
Δr-2.8 ± 1.7kJ/molTDAsWada, Kikkawa, et al., 2007gas phase

References

Wada, Kikkawa, et al., 2007
Wada, A.; Kikkawa, A.; Sugiyama, T.; Hiraoka, K., Thermochemical Stabilities of the Gas-phase Cluster Ions of Halide Ions with Rare Gas Atoms, Int. J. Mass Spectrom.., 2007, 267, 1-3, 284-287, https://doi.org/10.1016/j.ijms.2007.02.053 . [all data]