(D2O)3..Au2 anion

Gas phase ion energetics data

Data compiled by: John E. Bartmess

Electron affinity of neutral species

EAneutral (eV) Method Reference Comment
2.790 ± 0.035LPESZheng, Li, et al., 2007Stated electron affinity is the Vertical Detachment Energy

References

Zheng, Li, et al., 2007
Zheng, W.; Li, X.; Eustis, S.; Grubisic, A.; Thomas, O.; de Clercq, H.; Bowen, K., Anion photoelectron spectroscopy of Au-(H2O)(1,2), Au-2(-)(D2O)(1-4), and AuOH-, Chem. Phys. Lett., 2007, 444, 4-6, 232-236, https://doi.org/10.1016/j.cplett.2007.07.036 . [all data]