(H2O)7..(NC)2N anion

Gas phase ion energetics data

Data compiled by: John E. Bartmess

Electron affinity of neutral species

EAneutral (eV) Method Reference Comment
5.58 ± 0.10LPESJagoda-Cwiklik, Wang, et al., 2007Vertical Detachment Energy:5.80±0.10 eV

References

Jagoda-Cwiklik, Wang, et al., 2007
Jagoda-Cwiklik, B.; Wang, X.B.; Woo, H.K.; Yang, J.; Wang, G.J.; Zhou, M.F.; Jungwirth, P.; Wang, L.S., Microsolvation of the Dicyanamide Anion: [N(CN)(2)(-)](H2O)(n) (n=0-12), J. Phys. Chem. A, 2007, 111, 32, 7719-7725, https://doi.org/10.1021/jp071832n . [all data]