pCHO-anilide anion

Reaction thermochemistry data

Data compiled by: John E. Bartmess

Individual Reactions

C7H6NO- + Hydrogen cation = 4-aminobenzaldehyde

By formula: C7H6NO- + H+ = C7H7NO

Quantity Value Units Method Reference Comment
Δr349.6 ± 2.1kcal/molG+TSTaft and Topsom, 1987gas phase; value altered from reference due to change in acidity scale
Quantity Value Units Method Reference Comment
Δr342.3 ± 2.0kcal/molIMRETaft and Topsom, 1987gas phase; value altered from reference due to change in acidity scale

References

Taft and Topsom, 1987
Taft, R.W.; Topsom, R.D., The Nature and Analysis of Substituent Effects, Prog. Phys. Org. Chem., 1987, 16, 1. [all data]