PH radical anion

Gas phase thermochemistry data

Data compiled by: John E. Bartmess

Quantity Value Units Method Reference Comment
Δfgas137. ± 35.kJ/molAcidErvin and Lineberger, 2005
Δfgas218. ± 18.kJ/molEIAEHalmann and Platzner, 1969From PH3

Reaction thermochemistry data

Data compiled by: John E. Bartmess

Individual Reactions

HP- + Hydrogen cation = Phosphino radical

By formula: HP- + H+ = H2P

Quantity Value Units Method Reference Comment
Δr1547. ± 34.kJ/molD-EAErvin and Lineberger, 2005gas phase

References

Ervin and Lineberger, 2005
Ervin, K.M.; Lineberger, W.C., Photoelectron spectroscopy of phosphorus hydride anions, J. Chem. Phys., 2005, 122, 19, 194303, https://doi.org/10.1063/1.1881153 . [all data]

Halmann and Platzner, 1969
Halmann, M.; Platzner, I., Negative Ions Produced by Electron Capture in Phosphine, J. Phys. Chem., 1969, 73, 12, 4376, https://doi.org/10.1021/j100846a062 . [all data]