Au2Cu anion

Gas phase ion energetics data

Data compiled by: John E. Bartmess

Electron affinity of neutral species

EAneutral (eV) Method Reference Comment
3.87 ± 0.11LPESKoyasu, Naono, et al., 2006Vertical Detachment Energy: 4.12±0.01 eV

References

Koyasu, Naono, et al., 2006
Koyasu, K.; Naono, Y.; Akutsu, M.; Mitsui, M.; Nakajima, A., Photoelectron spectroscopy of binary Au cluster anions with a doped metal atom: AunM- (n=2-7), M = Pd, Ni, Zn, Cu, and Mg, Chem. Phys. Lett., 2006, 422, 1-3, 62-66, https://doi.org/10.1016/j.cplett.2006.02.034 . [all data]