V2C9 radical anion

Gas phase ion energetics data

Data compiled by: John E. Bartmess

Electron affinity of neutral species

EAneutral (eV) Method Reference Comment
1.80 ± 0.14LPESKnappenberger, Jones, et al., 2006Stated electron affinity is the Vertical Detachment Energy

References

Knappenberger, Jones, et al., 2006
Knappenberger, K.L.; Jones, C.E.; Sobhy, M.A.; Iordanov, I.; Sofo, J.; Castleman, A.W., Anion photoelectron spectroscopy and density functional investigation of vanadium carbide clusters, J. Phys. Chem. A, 2006, 110, 47, 12814-12821, https://doi.org/10.1021/jp065273g . [all data]