1,8-diaminonaphthalenide anion

Reaction thermochemistry data

Data compiled by: John E. Bartmess

Individual Reactions

C10H9N2- + Hydrogen cation = 1,8-Naphthalenediamine

By formula: C10H9N2- + H+ = C10H10N2

Quantity Value Units Method Reference Comment
Δr1441. ± 8.4kJ/molIMREArnett, Venkatasubaramanian, et al., 1982gas phase; value altered from reference due to change in acidity scale

Gas phase ion energetics data

Data compiled by: John E. Bartmess

Protonation reactions

C10H9N2- + Hydrogen cation = 1,8-Naphthalenediamine

By formula: C10H9N2- + H+ = C10H10N2

Quantity Value Units Method Reference Comment
Δr1441. ± 8.4kJ/molIMREArnett, Venkatasubaramanian, et al., 1982gas phase; value altered from reference due to change in acidity scale

References

Arnett, Venkatasubaramanian, et al., 1982
Arnett, E.M.; Venkatasubaramanian, K.G.; McIver, R.T.; Fukuda, E.K.; Bordwell, F.G.; Press, F.D., Stabilization of the monoanion of 1,8-diaminonaphthalene by intramolecular hydrogen bonding. A novel case of anion homoconjugation in superbase solution, J. Am. Chem. Soc., 1982, 104, 325. [all data]