mCO2Me-anilide anion

Reaction thermochemistry data

Data compiled by: John E. Bartmess

Individual Reactions

C8H8NO2- + Hydrogen cation = Benzoic acid, 3-amino-, methyl ester

By formula: C8H8NO2- + H+ = C8NO2

Quantity Value Units Method Reference Comment
Δr1509. ± 8.8kJ/molG+TSTaft and Topsom, 1987gas phase
Quantity Value Units Method Reference Comment
Δr1478. ± 8.4kJ/molIMRETaft and Topsom, 1987gas phase

Gas phase ion energetics data

Data compiled by: John E. Bartmess

Electron affinity of neutral species

EAneutral (eV) Method Reference Comment
1.94 ± 0.13D-EATaft and Topsom, 1987

Protonation reactions

C8H8NO2- + Hydrogen cation = Benzoic acid, 3-amino-, methyl ester

By formula: C8H8NO2- + H+ = C8NO2

Quantity Value Units Method Reference Comment
Δr1509. ± 8.8kJ/molG+TSTaft and Topsom, 1987gas phase
Quantity Value Units Method Reference Comment
Δr1478. ± 8.4kJ/molIMRETaft and Topsom, 1987gas phase

References

Taft and Topsom, 1987
Taft, R.W.; Topsom, R.D., The Nature and Analysis of Substituent Effects, Prog. Phys. Org. Chem., 1987, 16, 1. [all data]