pNO2-anilide anion

Gas phase ion energetics data

Data compiled by: John E. Bartmess

Protonation reactions

C6H5N2O2- + Hydrogen cation = p-Nitroaniline

By formula: C6H5N2O2- + H+ = C6H6N2O2

Quantity Value Units Method Reference Comment
Δr343.5 ± 2.1kcal/molG+TSTaft and Topsom, 1987gas phase; value altered from reference due to change in acidity scale
Quantity Value Units Method Reference Comment
Δr336.2 ± 2.0kcal/molIMRETaft and Topsom, 1987gas phase; value altered from reference due to change in acidity scale

Reaction thermochemistry data

Data compiled by: John E. Bartmess

Individual Reactions

C6H5N2O2- + Hydrogen cation = p-Nitroaniline

By formula: C6H5N2O2- + H+ = C6H6N2O2

Quantity Value Units Method Reference Comment
Δr343.5 ± 2.1kcal/molG+TSTaft and Topsom, 1987gas phase; value altered from reference due to change in acidity scale
Quantity Value Units Method Reference Comment
Δr336.2 ± 2.0kcal/molIMRETaft and Topsom, 1987gas phase; value altered from reference due to change in acidity scale

References

Taft and Topsom, 1987
Taft, R.W.; Topsom, R.D., The Nature and Analysis of Substituent Effects, Prog. Phys. Org. Chem., 1987, 16, 1. [all data]