SiAl4 anion

Gas phase ion energetics data

Data compiled by: John E. Bartmess

Electron affinity of neutral species

EAneutral (eV) Method Reference Comment
2.121 ± 0.020LPESBoldyrev, Li, et al., 2000Vertical Detachment Energy: 2.094±0.020 eV

References

Boldyrev, Li, et al., 2000
Boldyrev, A.I.; Li, X.; Wang, L.S., Experimental observation of pentaatomic tetracoordinate planar Si- and Ge-containing molecules: MAl4- and MAl4, Angew. Chem. Intl. Ed. Engl., 2000, 39, 18, 3307-+, https://doi.org/10.1002/1521-3773(20000915)39:18<3307::AID-ANIE3307>3.0.CO;2-# . [all data]