LiAl4 anion

Gas phase ion energetics data

Data compiled by: John E. Bartmess

Electron affinity of neutral species

EAneutral (eV) Method Reference Comment
2.150 ± 0.060LPESLi, Kuznetsov, et al., 2001

References

Li, Kuznetsov, et al., 2001
Li, X.; Kuznetsov, A.E.; Zhnag, H.-F.; Boldryev, A.I.; Wang, L.-S., Observation of all-Metal Aromatic Molecules, Science, 2001, 291, 5505, 859, https://doi.org/10.1126/science.291.5505.859 . [all data]