(pyrene)2 radical anion

Gas phase ion energetics data

Data compiled by: John E. Bartmess

Electron affinity of neutral species

EAneutral (eV) Method Reference Comment
0.6200 ± 0.0043LPESAndo, Kokubo, et al., 2004EA est. from figure. (pyrene)n- to n=20 are also given, but no EAs assigned by the authors

References

Ando, Kokubo, et al., 2004
Ando, N.; Kokubo, S.; Mitsui, M.; Nakajima, A., Photoelectron spectroscopy of pyrene cluster anions, (pyrene)(-)(n) (n=1-20), Chem. Phys. Lett., 2004, 389, 4-6, 279-283, https://doi.org/10.1016/j.cplett.2004.03.100 . [all data]