6-Me-uracilide(N3) anion

Reaction thermochemistry data

Data compiled by: John E. Bartmess

Individual Reactions

C5H5N2O2- + Hydrogen cation = 6-Methyluracil

By formula: C5H5N2O2- + H+ = C5H6N2O2

Quantity Value Units Method Reference Comment
Δr352.0 ± 5.0kcal/molIMRBLee, 2005gas phase

References

Lee, 2005
Lee, J.K., Insights into nucleic acid reactivity through gas-phase experimental and computational studies, Int. J. Mass Spectrom., 2005, 240, 3, 261-272, https://doi.org/10.1016/j.ijms.2004.09.020 . [all data]