3-Me-uracilide(C6) anion

Gas phase ion energetics data

Data compiled by: John E. Bartmess

Protonation reactions

C5H5N2O2- + Hydrogen cation = 3-Methyluracil

By formula: C5H5N2O2- + H+ = C5H6N2O2

Quantity Value Units Method Reference Comment
Δr363.0 ± 3.0kcal/molIMRBLee, 2005gas phase

References

Lee, 2005
Lee, J.K., Insights into nucleic acid reactivity through gas-phase experimental and computational studies, Int. J. Mass Spectrom., 2005, 240, 3, 261-272, https://doi.org/10.1016/j.ijms.2004.09.020 . [all data]