pCl-anilide anion

Reaction thermochemistry data

Data compiled by: John E. Bartmess

Individual Reactions

C6H5ClN- + Hydrogen cation = p-Chloroaniline

By formula: C6H5ClN- + H+ = C6H6ClN

Quantity Value Units Method Reference Comment
Δr1508. ± 8.8kJ/molG+TSBartmess, Scott, et al., 1979gas phase; value altered from reference due to change in acidity scale
Quantity Value Units Method Reference Comment
Δr1477. ± 8.4kJ/molIMREBartmess, Scott, et al., 1979gas phase; value altered from reference due to change in acidity scale

References

Bartmess, Scott, et al., 1979
Bartmess, J.E.; Scott, J.A.; McIver, R.T., Jr., The gas phase acidity scale from methanol to phenol, J. Am. Chem. Soc., 1979, 101, 6047. [all data]