Zn(SC(CN)=C(CN)S)2 dianion

Gas phase ion energetics data

Data compiled by: John E. Bartmess

Electron affinity of neutral species

EAneutral (eV) Reference Comment
1.330 ± 0.050Waters, Wang, et al., 2006Vertical Detachment Energy: 1.56±0.05 eV

References

Waters, Wang, et al., 2006
Waters, T.; Wang, X.B.; Woo, H.K.; Wang, L.S., Photoelectron Spectroscopy of the bis(dithiolene) anions [M(mnt)(2)](n-)( M = Fe-Zn; n=1, 2): Changes in electronic structure with variation of metal center and with oxidation, Inorg. Chem., 2006, 45, 15, 5841-5851, https://doi.org/10.1021/ic060255z . [all data]