5-pyrazolide anion

Gas phase ion energetics data

Data compiled by: John E. Bartmess

Electron affinity of neutral species

EAneutral (eV) Method Reference Comment
2.1040 ± 0.0050LPESGianola, Ichino, et al., 2006

References

Gianola, Ichino, et al., 2006
Gianola, A.J.; Ichino, T.; Kato, S.; Bierbaum, V.M.; Lineberger, W.C., Thermochemical studies of pyrazolide, J. Phys. Chem. A, 2006, 110, 27, 8457-8466, https://doi.org/10.1021/jp057499+ . [all data]