F2ClP..Cl anion

Gas phase thermochemistry data

Data compiled by: John E. Bartmess

Quantity Value Units Method Reference Comment
Δfgas-253.67kcal/molTherCheck, Lobring, et al., 2003

Reaction thermochemistry data

Data compiled by: John E. Bartmess

Individual Reactions

Chlorine anion + Phosphorus difluoride monochloride = Cl2F2P-

By formula: Cl- + ClF2P = Cl2F2P-

Quantity Value Units Method Reference Comment
Δr23.66kcal/molN/ACheck, Lobring, et al., 2003gas phase

Ion clustering data

Data compiled by: John E. Bartmess

Clustering reactions

Chlorine anion + Phosphorus difluoride monochloride = Cl2F2P-

By formula: Cl- + ClF2P = Cl2F2P-

Quantity Value Units Method Reference Comment
Δr23.66kcal/molN/ACheck, Lobring, et al., 2003gas phase

References

Check, Lobring, et al., 2003
Check, C.E.; Lobring, K.C.; Keating, P.R.; Gilbert, T.M.; Sunderlin, L.S., Effect of substituents on the strength of hypervalent phosphorus-halogen bonds, J. Phys. Chem. A, 2003, 107, 42, 8961-8967, https://doi.org/10.1021/jp030287x . [all data]