pCN-anilide anion

Reaction thermochemistry data

Data compiled by: John E. Bartmess

Individual Reactions

C7H5N2- + Hydrogen cation = Benzonitrile, 4-amino-

By formula: C7H5N2- + H+ = C7H6N2

Quantity Value Units Method Reference Comment
Δr1459. ± 8.8kJ/molG+TSTaft and Topsom, 1987gas phase; value altered from reference due to change in acidity scale
Quantity Value Units Method Reference Comment
Δr1429. ± 8.4kJ/molIMRETaft and Topsom, 1987gas phase; value altered from reference due to change in acidity scale

Gas phase ion energetics data

Data compiled by: John E. Bartmess

Protonation reactions

C7H5N2- + Hydrogen cation = Benzonitrile, 4-amino-

By formula: C7H5N2- + H+ = C7H6N2

Quantity Value Units Method Reference Comment
Δr1459. ± 8.8kJ/molG+TSTaft and Topsom, 1987gas phase; value altered from reference due to change in acidity scale
Quantity Value Units Method Reference Comment
Δr1429. ± 8.4kJ/molIMRETaft and Topsom, 1987gas phase; value altered from reference due to change in acidity scale

References

Taft and Topsom, 1987
Taft, R.W.; Topsom, R.D., The Nature and Analysis of Substituent Effects, Prog. Phys. Org. Chem., 1987, 16, 1. [all data]