SO3..I anion

Reaction thermochemistry data

Data compiled by: John E. Bartmess

Individual Reactions

Iodide + sulphur trioxide = IO3S-

By formula: I- + O3S = IO3S-

Quantity Value Units Method Reference Comment
Δr38.5 ± 2.1kcal/molCIDTHao, Gilbert, et al., 2006gas phase

Ion clustering data

Data compiled by: John E. Bartmess

Clustering reactions

Iodide + sulphur trioxide = IO3S-

By formula: I- + O3S = IO3S-

Quantity Value Units Method Reference Comment
Δr38.5 ± 2.1kcal/molCIDTHao, Gilbert, et al., 2006gas phase

References

Hao, Gilbert, et al., 2006
Hao, C.; Gilbert, T.M.; Sunderlin, L.S., The Bond Dissociation Energies of SO3-X- (X = F, Cl, Br, and I), Can. J. Chem., 2006, 83, 11, 2013-2019, https://doi.org/10.1139/v05-216 . [all data]