(biphenyl)3 radical anion

Gas phase ion energetics data

Data compiled by: John E. Bartmess

Electron affinity of neutral species

EAneutral (eV) Method Reference Comment
0.280 ± 0.020LPESMitsui, Matsumoto, et al., 2005Stated electron affinity is the Vertical Detachment Energy

References

Mitsui, Matsumoto, et al., 2005
Mitsui, M.; Matsumoto, Y.; Ando, N.; Nakajima, A., Formation and photoelectron spectroscopy of nanoscale cluster anions of biphenyl, (BP)(n)(-) (n=2-100), Chem. Lett., 2005, 34, 9, 1244-1245, https://doi.org/10.1246/cl.2005.1244 . [all data]