Ga2N anion

Gas phase ion energetics data

Data compiled by: John E. Bartmess

Electron affinity of neutral species

EAneutral (eV) Method Reference Comment
2.5060 ± 0.0080LPESSheehan, Meloni, et al., 2006

References

Sheehan, Meloni, et al., 2006
Sheehan, S.M.; Meloni, G.; Parsons, B.F.; Wehres, N.; Neumark, D.M., Spectroscopic characterization of the ground and low-lying electronic states of Ga2N via anion photoelectron spectroscopy, J. Chem. Phys., 2006, 124, 6, 064303, https://doi.org/10.1063/1.2159492 . [all data]