mF-anilide anion

Gas phase ion energetics data

Data compiled by: John E. Bartmess

Protonation reactions

C6H5FN- + Hydrogen cation = Benzenamine, 3-fluoro-

By formula: C6H5FN- + H+ = C6H6FN

Quantity Value Units Method Reference Comment
Δr361.2 ± 2.1kcal/molG+TSBartmess, Scott, et al., 1979gas phase; value altered from reference due to change in acidity scale
Quantity Value Units Method Reference Comment
Δr353.9 ± 2.0kcal/molIMREBartmess, Scott, et al., 1979gas phase; value altered from reference due to change in acidity scale

Reaction thermochemistry data

Data compiled by: John E. Bartmess

Individual Reactions

C6H5FN- + Hydrogen cation = Benzenamine, 3-fluoro-

By formula: C6H5FN- + H+ = C6H6FN

Quantity Value Units Method Reference Comment
Δr361.2 ± 2.1kcal/molG+TSBartmess, Scott, et al., 1979gas phase; value altered from reference due to change in acidity scale
Quantity Value Units Method Reference Comment
Δr353.9 ± 2.0kcal/molIMREBartmess, Scott, et al., 1979gas phase; value altered from reference due to change in acidity scale

References

Bartmess, Scott, et al., 1979
Bartmess, J.E.; Scott, J.A.; McIver, R.T., Jr., The gas phase acidity scale from methanol to phenol, J. Am. Chem. Soc., 1979, 101, 6047. [all data]