5-imidazolide anion

Gas phase ion energetics data

Data compiled by: John E. Bartmess

Electron affinity of neutral species

EAneutral (eV) Method Reference Comment
1.992 ± 0.010LPESGianola, Ichino, et al., 2005Deprotonated at C-5

References

Gianola, Ichino, et al., 2005
Gianola, A.J.; Ichino, T.; Hoenigman, R.L.; Kato, S.; Bierbaum, V.M.; Lineberger, W.C., Photoelectron spectra and ion chemistry of imidazolide, J. Phys. Chem. A, 2005, 109, 50, 11504-11514, https://doi.org/10.1021/jp053566o . [all data]