[GlyGly..GlyGly-H]) anion

Reaction thermochemistry data

Data compiled by: John E. Bartmess

Individual Reactions

CAS Reg. No. 23372-53-4 + N-Glycylglycine = C8H15N4O6-

By formula: CAS Reg. No. 23372-53-4 + C4H8N2O3 = C8H15N4O6-

Quantity Value Units Method Reference Comment
Δr7.50 ± 0.30kcal/molTDEqLiu, Wyttenbacj, et al., 2004gas phase
Quantity Value Units Method Reference Comment
Δr3.12kcal/molTDEqLiu, Wyttenbacj, et al., 2004gas phase

References

Liu, Wyttenbacj, et al., 2004
Liu, D.; Wyttenbacj, T.; Carpenter, C.J.; Bowers, M.T., Investigation of Non-Covalent Interactions in Deprotonated Peptides: Structural and Energetic Competition between Aggregation and Hydration, J. Am. Chem. Soc., 2004, 126, 10, 3261, https://doi.org/10.1021/ja0393628 . [all data]