SiH radical anion

Gas phase thermochemistry data

Data compiled by: John E. Bartmess

Quantity Value Units Method Reference Comment
Δfgas246. ± 11.kJ/molAcidKasdan, Herbst, et al., 1975

Reaction thermochemistry data

Data compiled by: John E. Bartmess

Individual Reactions

HSi- + Hydrogen cation = Silylene

By formula: HSi- + H+ = H2Si

Quantity Value Units Method Reference Comment
Δr1502. ± 9.6kJ/molD-EAKasdan, Herbst, et al., 1975gas phase

Gas phase ion energetics data

Data compiled by: John E. Bartmess

Protonation reactions

HSi- + Hydrogen cation = Silylene

By formula: HSi- + H+ = H2Si

Quantity Value Units Method Reference Comment
Δr1502. ± 9.6kJ/molD-EAKasdan, Herbst, et al., 1975gas phase

References

Kasdan, Herbst, et al., 1975
Kasdan, A.; Herbst, E.; Lineberger, W.C., Laser photoelectron spectrometry of the negative ions of silicon and its hydrides, J. Chem. Phys., 1975, 62, 541. [all data]