H2O..[AlaAla-H] anion

Reaction thermochemistry data

Data compiled by: John E. Bartmess

Individual Reactions

CAS Reg. No. 581782-45-8 + Water = C6H13N2O4-

By formula: CAS Reg. No. 581782-45-8 + H2O = C6H13N2O4-

Quantity Value Units Method Reference Comment
Δr11.70 ± 0.20kcal/molTDEqLiu, Wyttenbacj, et al., 2004gas phase
Quantity Value Units Method Reference Comment
Δr6.60kcal/molTDEqLiu, Wyttenbacj, et al., 2004gas phase

References

Liu, Wyttenbacj, et al., 2004
Liu, D.; Wyttenbacj, T.; Carpenter, C.J.; Bowers, M.T., Investigation of Non-Covalent Interactions in Deprotonated Peptides: Structural and Energetic Competition between Aggregation and Hydration, J. Am. Chem. Soc., 2004, 126, 10, 3261, https://doi.org/10.1021/ja0393628 . [all data]