mMe-anilide anion

Reaction thermochemistry data

Data compiled by: John E. Bartmess

Individual Reactions

C7H8N- + Hydrogen cation = Benzenamine, 3-methyl-

By formula: C7H8N- + H+ = C7H9N

Quantity Value Units Method Reference Comment
Δr366.8 ± 2.1kcal/molG+TSBartmess, Scott, et al., 1979gas phase; value altered from reference due to change in acidity scale
Quantity Value Units Method Reference Comment
Δr359.6 ± 2.0kcal/molIMREBartmess, Scott, et al., 1979gas phase; value altered from reference due to change in acidity scale

Gas phase ion energetics data

Data compiled by: John E. Bartmess

Electron affinity of neutral species

EAneutral (eV) Method Reference Comment
1.58 ± 0.13D-EABartmess, Scott, et al., 1979value altered from reference due to change in acidity scale

Protonation reactions

C7H8N- + Hydrogen cation = Benzenamine, 3-methyl-

By formula: C7H8N- + H+ = C7H9N

Quantity Value Units Method Reference Comment
Δr366.8 ± 2.1kcal/molG+TSBartmess, Scott, et al., 1979gas phase; value altered from reference due to change in acidity scale
Quantity Value Units Method Reference Comment
Δr359.6 ± 2.0kcal/molIMREBartmess, Scott, et al., 1979gas phase; value altered from reference due to change in acidity scale

References

Bartmess, Scott, et al., 1979
Bartmess, J.E.; Scott, J.A.; McIver, R.T., Jr., The gas phase acidity scale from methanol to phenol, J. Am. Chem. Soc., 1979, 101, 6047. [all data]