C60O3 anion

Gas phase ion energetics data

Data compiled by: John E. Bartmess

Electron affinity of neutral species

EAneutral (eV) Method Reference Comment
0.1214 ± 0.0043LPESWang, Woo, et al., 2005Rough adiabatic EA estimated from LPES Threshold.

References

Wang, Woo, et al., 2005
Wang, X.B.; Woo, H.K.; Kiran, B.; Wang, L.S., Photoelectron spectroscopy and electronic structures of fullerene oxides: C60Ox- (x=1-3), J. Phys. Chem. A, 2005, 109, 49, 11089-11092, https://doi.org/10.1021/jp055775e . [all data]