anilide anion

Reaction thermochemistry data

Data compiled by: John E. Bartmess

Individual Reactions

C6H6N- + Hydrogen cation = Aniline

By formula: C6H6N- + H+ = C6H7N

Quantity Value Units Method Reference Comment
Δr368.18 ± 0.30kcal/molD-EAWren, Vogelhuber, et al., 2012gas phase
Δr366.4 ± 2.1kcal/molG+TSBartmess, Scott, et al., 1979gas phase; value altered from reference due to change in acidity scale
Quantity Value Units Method Reference Comment
Δr360.91 ± 0.67kcal/molH-TSWren, Vogelhuber, et al., 2012gas phase
Δr359.1 ± 2.0kcal/molIMREBartmess, Scott, et al., 1979gas phase; value altered from reference due to change in acidity scale

Gas phase ion energetics data

Data compiled by: John E. Bartmess

Protonation reactions

C6H6N- + Hydrogen cation = Aniline

By formula: C6H6N- + H+ = C6H7N

Quantity Value Units Method Reference Comment
Δr368.18 ± 0.30kcal/molD-EAWren, Vogelhuber, et al., 2012gas phase
Δr366.4 ± 2.1kcal/molG+TSBartmess, Scott, et al., 1979gas phase; value altered from reference due to change in acidity scale
Quantity Value Units Method Reference Comment
Δr360.91 ± 0.67kcal/molH-TSWren, Vogelhuber, et al., 2012gas phase
Δr359.1 ± 2.0kcal/molIMREBartmess, Scott, et al., 1979gas phase; value altered from reference due to change in acidity scale

References

Wren, Vogelhuber, et al., 2012
Wren, S.W.; Vogelhuber, K.M.; Ichino, T.; Stanton, J.F.; Lineberger, W.C., Photoelectron Spectroscopy of Anilinide and Acidity of Aniline, J. Phys. Chem. A, 2012, 116, 12, 3118-3123, https://doi.org/10.1021/jp211463r . [all data]

Bartmess, Scott, et al., 1979
Bartmess, J.E.; Scott, J.A.; McIver, R.T., Jr., The gas phase acidity scale from methanol to phenol, J. Am. Chem. Soc., 1979, 101, 6047. [all data]