(H2O)17..SO4 dianion

Ion clustering data

Data compiled by: John E. Bartmess

Clustering reactions

Sulfate + 17Water = H34O21S-2

By formula: O4S-2 + 17H2O = H34O21S-2

Quantity Value Units Method Reference Comment
Δr4.2 ± 2.0kcal/molIMREBlades and Kebarle, 2005gas phase; dGaff at 270K; 298 value probably ca. 0.5 kcal/mole weaker

References

Blades and Kebarle, 2005
Blades, A.T.; Kebarle, P., Sequential hydration energies of the sulfate ion, from determinations of the equilibrium constants for the gas-phase reactions: SO4(H2O)(n)(2-) = SO4(H2O)(n-1)(2-)+H2O, J. Phys. Chem. A, 2005, 109, 37, 8293-8298, https://doi.org/10.1021/jp0540353 . [all data]