(H2O)15..SO4 dianion

Reaction thermochemistry data

Data compiled by: John E. Bartmess

Individual Reactions

Sulfate + 15Water = H30O19S-2

By formula: O4S-2 + 15H2O = H30O19S-2

Quantity Value Units Method Reference Comment
Δr19. ± 8.4kJ/molIMREBlades and Kebarle, 2005gas phase; dGaff at 270K; 298 value probably ca. 0.5 kcal/mole weaker

References

Blades and Kebarle, 2005
Blades, A.T.; Kebarle, P., Sequential hydration energies of the sulfate ion, from determinations of the equilibrium constants for the gas-phase reactions: SO4(H2O)(n)(2-) = SO4(H2O)(n-1)(2-)+H2O, J. Phys. Chem. A, 2005, 109, 37, 8293-8298, https://doi.org/10.1021/jp0540353 . [all data]