(N2H7+) dianion

Gas phase ion energetics data

Data compiled by: John E. Bartmess

Electron affinity of neutral species

EAneutral (eV) Method Reference Comment
0.415 ± 0.015LPESXu, Nilles, et al., 2002Double Rydberg ion: core cation, with two orbiting Rydberg electrons

References

Xu, Nilles, et al., 2002
Xu, S.J.; Nilles, J.M.; Hendricks, J.H.; Lyapustina, S.A.; Bowen, K.H., Double Rydberg anions: Photoelectron spectroscopy of NH4-, N2H7-, N3H10-, N4H13-, and N5H16-, J. Chem. Phys., 2002, 117, 12, 5742-5747, https://doi.org/10.1063/1.1499491 . [all data]