(NH3)5..H anion

Gas phase ion energetics data

Data compiled by: John E. Bartmess

Electron affinity of neutral species

EAneutral (eV) Method Reference Comment
2.390 ± 0.020N/AGrumbling and Sanov, 2011Stated electron affinity is the Vertical Detachment Energy
2.360 ± 0.010LPESXu, Nilles, et al., 2002Stated electron affinity is the Vertical Detachment Energy

References

Grumbling and Sanov, 2011
Grumbling, E.R.; Sanov, A., Solvation effects on angular distributions in H-(NH3)(n) and NH2-(NH3)(n) photodetachment: Role of solute electronic structure, J. Chem. Phys., 2011, 135, 16, 164301, https://doi.org/10.1063/1.3653232 . [all data]

Xu, Nilles, et al., 2002
Xu, S.J.; Nilles, J.M.; Hendricks, J.H.; Lyapustina, S.A.; Bowen, K.H., Double Rydberg anions: Photoelectron spectroscopy of NH4-, N2H7-, N3H10-, N4H13-, and N5H16-, J. Chem. Phys., 2002, 117, 12, 5742-5747, https://doi.org/10.1063/1.1499491 . [all data]