CH2=CHTe anion

Reaction thermochemistry data

Data compiled by: John E. Bartmess

Individual Reactions

C2H3Te- + Hydrogen cation = C2H4Te

By formula: C2H3Te- + H+ = C2H4Te

Quantity Value Units Method Reference Comment
Δr1382. ± 11.kJ/molIMRBGuillemin, Riague, et al., 2005gas phase; Acid: CH2=CHTeH

References

Guillemin, Riague, et al., 2005
Guillemin, J.C.; Riague, E.H.; Gal, J.F.; Maria, P.C.; Mo, O.; Yanez, M., Acidity trends in alpha,beta-unsaturated sulfur, selenium, and tellurium derivatives: Comparison with C-, Si-, Ge-, Sn-, N-, P-, As-, and Sb-containing analogues, Chem. Eur. J., 2005, 11, 7, 2145-2153, https://doi.org/10.1002/chem.200400989 . [all data]