EtTe anion

Reaction thermochemistry data

Data compiled by: John E. Bartmess

Individual Reactions

C2H5Te- + Hydrogen cation = C2H6Te

By formula: C2H5Te- + H+ = C2H6Te

Quantity Value Units Method Reference Comment
Δr1403. ± 12.kJ/molIMRBGuillemin, Riague, et al., 2005gas phase

Gas phase ion energetics data

Data compiled by: John E. Bartmess

Protonation reactions

C2H5Te- + Hydrogen cation = C2H6Te

By formula: C2H5Te- + H+ = C2H6Te

Quantity Value Units Method Reference Comment
Δr1403. ± 12.kJ/molIMRBGuillemin, Riague, et al., 2005gas phase

References

Guillemin, Riague, et al., 2005
Guillemin, J.C.; Riague, E.H.; Gal, J.F.; Maria, P.C.; Mo, O.; Yanez, M., Acidity trends in alpha,beta-unsaturated sulfur, selenium, and tellurium derivatives: Comparison with C-, Si-, Ge-, Sn-, N-, P-, As-, and Sb-containing analogues, Chem. Eur. J., 2005, 11, 7, 2145-2153, https://doi.org/10.1002/chem.200400989 . [all data]