Cl..ClPS anion

Reaction thermochemistry data

Data compiled by: John E. Bartmess

Individual Reactions

CAS Reg. No. 666718-71-4 + Chlorine atom = Cl2PS-

By formula: CAS Reg. No. 666718-71-4 + Cl = Cl2PS-

Quantity Value Units Method Reference Comment
Δr44.5 ± 1.4kcal/molCIDTLobring, Check, et al., 2005gas phase; Affinity is Cl.. ClPS-

References

Lobring, Check, et al., 2005
Lobring, K.C.; Check, C.E.; Boggs, M.L.; Keating, P.R.; Sunderlin, L.S., Bond strengths in POCl3-, POCl2-, and PSCl2-, Int. J. Mass Spectrom., 2005, 241, 1, 75-81, https://doi.org/10.1016/j.ijms.2004.10.023 . [all data]