iPrNH anion

Reaction thermochemistry data

Data compiled by: John E. Bartmess

Individual Reactions

C3H8N- + Hydrogen cation = 2-Propanamine

By formula: C3H8N- + H+ = C3H9N

Quantity Value Units Method Reference Comment
Δr1662. ± 13.kJ/molG+TSBrauman and Blair, 1971gas phase
Quantity Value Units Method Reference Comment
Δr1631. ± 13.kJ/molIMRBBrauman and Blair, 1971gas phase

Gas phase ion energetics data

Data compiled by: John E. Bartmess

Electron affinity of neutral species

EAneutral (eV) Method Reference Comment
0.75 ± 0.19D-EABrauman and Blair, 1971

Protonation reactions

C3H8N- + Hydrogen cation = 2-Propanamine

By formula: C3H8N- + H+ = C3H9N

Quantity Value Units Method Reference Comment
Δr1662. ± 13.kJ/molG+TSBrauman and Blair, 1971gas phase
Quantity Value Units Method Reference Comment
Δr1631. ± 13.kJ/molIMRBBrauman and Blair, 1971gas phase

References

Brauman and Blair, 1971
Brauman, J.I.; Blair, L.K., Gas phase acidities of amines, J. Am. Chem. Soc., 1971, 93, 3911. [all data]