EtNH anion

Reaction thermochemistry data

Data compiled by: John E. Bartmess

Individual Reactions

C2H6N- + Hydrogen cation = Ethylamine

By formula: C2H6N- + H+ = C2H7N

Quantity Value Units Method Reference Comment
Δr1671. ± 4.6kJ/molG+TSMacKay, Hemsworth, et al., 1976gas phase
Quantity Value Units Method Reference Comment
Δr1638.9 ± 2.9kJ/molIMREMacKay, Hemsworth, et al., 1976gas phase

Gas phase ion energetics data

Data compiled by: John E. Bartmess

Electron affinity of neutral species

EAneutral (eV) Method Reference Comment
0.62 ± 0.14D-EAMacKay, Hemsworth, et al., 1976

Protonation reactions

C2H6N- + Hydrogen cation = Ethylamine

By formula: C2H6N- + H+ = C2H7N

Quantity Value Units Method Reference Comment
Δr1671. ± 4.6kJ/molG+TSMacKay, Hemsworth, et al., 1976gas phase
Quantity Value Units Method Reference Comment
Δr1638.9 ± 2.9kJ/molIMREMacKay, Hemsworth, et al., 1976gas phase

References

MacKay, Hemsworth, et al., 1976
MacKay, G.J.; Hemsworth, R.S.; Bohme, D.K., Absolute gas-phase acidities of CH3NH2, C2H5NH2, (CH3)2NH, and (CH3)3N, Can. J. Chem., 1976, 54, 1624. [all data]