HO2CCO2 anion

Reaction thermochemistry data

Data compiled by: John E. Bartmess

Individual Reactions

C2HO4- + Hydrogen cation = Oxalic acid

By formula: C2HO4- + H+ = C2H2O4

Quantity Value Units Method Reference Comment
Δr1356. ± 8.4kJ/molCIDCKumar, Prabhakar, et al., 2005gas phase
Quantity Value Units Method Reference Comment
Δr1323. ± 8.4kJ/molCIDCKumar, Prabhakar, et al., 2005gas phase

References

Kumar, Prabhakar, et al., 2005
Kumar, M.R.; Prabhakar, S.; Nagaveni, V.; Vairamani, M., Estimation of gas-phase acidities of a series of dicarboxylic acids by the kinetic method, Rapid Commun. Mass Spectrom., 2005, 19, 8, 1053-1057, https://doi.org/10.1002/rcm.1888 . [all data]