HO2C(CH2)8CO2 anion

Reaction thermochemistry data

Data compiled by: John E. Bartmess

Individual Reactions

C10H17O4- + Hydrogen cation = Decanedioic acid

By formula: C10H17O4- + H+ = C10H18O4

Quantity Value Units Method Reference Comment
Δr1364. ± 8.4kJ/molCIDCKumar, Prabhakar, et al., 2005gas phase
Quantity Value Units Method Reference Comment
Δr1345. ± 8.4kJ/molCIDCKumar, Prabhakar, et al., 2005gas phase

Gas phase ion energetics data

Data compiled by: John E. Bartmess

Electron affinity of neutral species

EAneutral (eV) Method Reference Comment
4.37 ± 0.12D-EAKumar, Prabhakar, et al., 2005

Protonation reactions

C10H17O4- + Hydrogen cation = Decanedioic acid

By formula: C10H17O4- + H+ = C10H18O4

Quantity Value Units Method Reference Comment
Δr1364. ± 8.4kJ/molCIDCKumar, Prabhakar, et al., 2005gas phase
Quantity Value Units Method Reference Comment
Δr1345. ± 8.4kJ/molCIDCKumar, Prabhakar, et al., 2005gas phase

References

Kumar, Prabhakar, et al., 2005
Kumar, M.R.; Prabhakar, S.; Nagaveni, V.; Vairamani, M., Estimation of gas-phase acidities of a series of dicarboxylic acids by the kinetic method, Rapid Commun. Mass Spectrom., 2005, 19, 8, 1053-1057, https://doi.org/10.1002/rcm.1888 . [all data]