pMe-C6H4CH2O anion

Gas phase ion energetics data

Data compiled by: John E. Bartmess

Electron affinity of neutral species

EAneutral (eV) Method Reference Comment
2.04 ± 0.13D-EAMustanir, Than, et al., 2005

References

Mustanir, Than, et al., 2005
Mustanir; Than, S.; Mishima, M., Substituent effects on the gas phase acidity of phenylacetylenes and benzyl alcohols, Bull. Chem. Soc. Japan, 2005, 78, 1, 147-153, https://doi.org/10.1246/bcsj.78.147 . [all data]