CrSi8 anion

Gas phase ion energetics data

Data compiled by: John E. Bartmess

Electron affinity of neutral species

EAneutral (eV) Method Reference Comment
2.710 ± 0.050LPESZheng, Milles, et al., 2005Stated electron affinity is the Vertical Detachment Energy

References

Zheng, Milles, et al., 2005
Zheng, W.; Milles, J.M.; Radisic, D.; Bowen, K.H., Jr., Photoelectron Spectroscopy of Chromium-Doped Silicon Cluster Anions, J. Chem. Phys., 2005, 122, 7, 071101, https://doi.org/10.1063/1.1851984 . [all data]